Target
Prothrombin
Ligand
BDBM50064653
Substrate
Meas. Tech.
ChEMBL_208340 (CHEMBL813651)
Ki
24±n/a nM
Citation
 Bone, RLu, TIllig, CRSoll, RMSpurlino, JC Structural analysis of thrombin complexed with potent inhibitors incorporating a phenyl group as a peptide mimetic and aminopyridines as guanidine substitutes. J Med Chem 41:2068-75 (1998)  
Target
Name:
Prothrombin
Synonyms:
Activation peptide fragment 1 Coagulation factor II Prothrombin precursor Thrombin heavy chain | Thrombin light chain
Type:
Protein
Mol. Mass.:
70029.57
Organism:
Homo sapiens (Human)
Description:
P00734
Residue:
622
  
Inhibitor
Name:
BDBM50064653
Synonyms:
2-Chloro-benzenesulfonic acid 3-methyl-5-[2-(methyl-pyridin-4-yl-amino)-ethoxy]-phenyl ester | CHEMBL289951
Type:
Small organic molecule
Emp. Form.:
C21H21ClN2O4S
Mol. Mass.:
432.92
SMILES:
CN(CCOc1cc(C)cc(OS(=O)(=O)c2ccccc2Cl)c1)c1ccncc1
: