Target
Endothelin-1 receptor
Ligand
BDBM50065513
Substrate
Meas. Tech.
ChEMBL_63353 (CHEMBL679118)
IC50
20±n/a nM
Citation
 Astles, PCBrealey, CBrown, TJFacchini, VHandscombe, CHarris, NVMcCarthy, CMcLay, IMPorter, BRoach, AGSargent, CSmith, CWalsh, RJ Selective endothelin A receptor antagonists. 3. Discovery and structure-activity relationships of a series of 4-phenoxybutanoic acid derivatives. J Med Chem 41:2732-44 (1998)  
Target
Name:
Endothelin-1 receptor
Synonyms:
EDNRA_RAT Ednra Endothelin-1 receptor
Type:
Enzyme Catalytic Domain
Mol. Mass.:
48256.91
Organism:
RAT
Description:
ENDOTHELIN A EDNRA RAT::P26684
Residue:
426
  
Inhibitor
Name:
BDBM50065513
Synonyms:
4-[2-Oxazol-2-yl-5-(thiophen-3-ylmethoxy)-phenoxy]-4-o-tolyl-butyric acid | CHEMBL96301
Type:
Small organic molecule
Emp. Form.:
C25H23NO5S
Mol. Mass.:
449.519
SMILES:
Cc1ccccc1C(CCC(O)=O)Oc1cc(OCc2ccsc2)ccc1-c1ncco1
: