Target
Endothelin-1 receptor
Ligand
BDBM50065515
Substrate
Meas. Tech.
ChEMBL_63353 (CHEMBL679118)
IC50
20±n/a nM
Citation
 Astles, PCBrealey, CBrown, TJFacchini, VHandscombe, CHarris, NVMcCarthy, CMcLay, IMPorter, BRoach, AGSargent, CSmith, CWalsh, RJ Selective endothelin A receptor antagonists. 3. Discovery and structure-activity relationships of a series of 4-phenoxybutanoic acid derivatives. J Med Chem 41:2732-44 (1998)  
Target
Name:
Endothelin-1 receptor
Synonyms:
EDNRA_RAT Ednra Endothelin-1 receptor
Type:
Enzyme Catalytic Domain
Mol. Mass.:
48256.91
Organism:
RAT
Description:
ENDOTHELIN A EDNRA RAT::P26684
Residue:
426
  
Inhibitor
Name:
BDBM50065515
Synonyms:
(R)-4-[2-Cyano-5-(pyridin-4-ylmethoxy)-phenoxy]-4-o-tolyl-butyric acid | CHEMBL92353
Type:
Small organic molecule
Emp. Form.:
C24H22N2O4
Mol. Mass.:
402.4425
SMILES:
Cc1ccccc1[C@@H](CCC(O)=O)Oc1cc(OCc2ccncc2)ccc1C#N
: