Target
Phospholipase A2, membrane associated
Ligand
BDBM50066342
Substrate
Meas. Tech.
ChEMBL_156206 (CHEMBL767149)
IC50
4200±n/a nM
Citation
 De Rosa, MGiordano, SScettri, ASodano, GSoriente, APastor, PGAlcaraz, MJPayá, M Synthesis and comparison of the antiinflammatory activity of manoalide and cacospongionolide B analogues. J Med Chem 41:3232-8 (1998)  
Target
Name:
Phospholipase A2, membrane associated
Synonyms:
GIIC sPLA2 NPS-PLA2 Non-pancreatic secretory phospholipase A2 (hnps-PLA2) PLA2B PLA2L Phospholipase A2 group IIA | RASF-A
Type:
Hydrolase
Mol. Mass.:
16101.20
Organism:
Homo sapiens (Human)
Description:
The human nps PLA2 was cloned, and expressed in E. coli. There was a refolding process in the purification.
Residue:
144
  
Inhibitor
Name:
BDBM50066342
Synonyms:
5-Hydroxy-4-[5-((2E,6E)-3,7,11-trimethyl-dodeca-2,6,10-trienyl)-3,6-dihydro-2H-pyran-2-yl]-5H-furan-2-one | CHEMBL109301
Type:
Small organic molecule
Emp. Form.:
C24H34O4
Mol. Mass.:
386.5244
SMILES:
[#6]\[#6](-[#6])=[#6]\[#6]-[#6]\[#6](-[#6])=[#6]\[#6]-[#6]\[#6](-[#6])=[#6]\[#6]-[#6]-1=[#6]-[#6]-[#6](-[#8]-[#6]-1)-[#6]-1=[#6]-[#6](=O)-[#8]-[#6]-1-[#8]
: