Target
D(2) dopamine receptor
Ligand
BDBM50010289
Substrate
Meas. Tech.
ChEMBL_60374 (CHEMBL672210)
Ki
20±n/a nM
Citation
 Wilcox, RETseng, TBrusniak, MYGinsburg, BPearlman, RSTeeter, MDuRand, CStarr, SNeve, KA CoMFA-based prediction of agonist affinities at recombinant D1 vs D2 dopamine receptors. J Med Chem 41:4385-99 (1998)  
Target
Name:
D(2) dopamine receptor
Synonyms:
D(2) dopamine receptor DOPAMINE D2 Long DRD2 Dopamine D2 receptor Dopamine D2 receptor (D2R) Dopamine2-like | d2
Type:
Cell-surface receptors
Mol. Mass.:
50647.10
Organism:
Homo sapiens (Human)
Description:
P14416
Residue:
443
  
Inhibitor
Name:
BDBM50010289
Synonyms:
(R)6-(Phenethyl-propyl-amino)-5,6,7,8-tetrahydro-naphthalen-1-ol (S)6-(Phenethyl-propyl-amino)-5,6,7,8-tetrahydro-naphthalen-1-ol CHEMBL109684 | N-0434
Type:
Small organic molecule
Emp. Form.:
C21H27NO
Mol. Mass.:
309.4452
SMILES:
CCCN(CCc1ccccc1)C1CCc2c(O)cccc2C1
: