Target
Carbonic anhydrase 2
Ligand
BDBM50079056
Substrate
Meas. Tech.
ChEMBL_45078 (CHEMBL657149)
Ki
5±n/a nM
Citation
 Scozzafava, AMenabuoni, LMincione, FBriganti, FMincione, GSupuran, CT Carbonic anhydrase inhibitors. Synthesis of water-soluble, topically effective, intraocular pressure-lowering aromatic/heterocyclic sulfonamides containing cationic or anionic moieties: is the tail more important than the ring? J Med Chem 42:2641-50 (1999)  
Target
Name:
Carbonic anhydrase 2
Synonyms:
CA-II CAC Carbonate dehydratase II Carbonic anhydrase 2 (CA-II) Carbonic anhydrase C Carbonic anhydrase II (CA-II) Carbonic anhydrase II (hCA II) | Carbonic anhydrase isoenzyme II (hCA II)
Type:
Enzyme
Mol. Mass.:
29250.71
Organism:
Homo sapiens (Human)
Description:
P00918
Residue:
260
  
Inhibitor
Name:
BDBM50079056
Synonyms:
2-[Ethyl-(6-methyl-7,7-dioxo-2-sulfamoyl-4,5,6,7-tetrahydro-7lambda*6*-thieno[2,3-b]thiopyran-4-yl)-carbamoyl]-nicotinic acid; compound with 3-[ethyl-(6-methyl-7,7-dioxo-2-sulfamoyl-4,5,6,7-tetrahydro-7lambda*6*-thieno[2,3-b]thiopyran-4-yl)-carbamoyl]-pyridine-2-carboxylic acid | CHEMBL327487
Type:
Small organic molecule
Emp. Form.:
C17H19N3O7S3
Mol. Mass.:
473.544
SMILES:
CCN(C1CC(C)S(=O)(=O)c2sc(cc12)S(N)(=O)=O)C(=O)c1ncccc1C(O)=O
: