Target
Carbonic anhydrase 4
Ligand
BDBM50079062
Substrate
Meas. Tech.
ChEMBL_45424 (CHEMBL657025)
Ki
10±n/a nM
Citation
 Scozzafava, AMenabuoni, LMincione, FBriganti, FMincione, GSupuran, CT Carbonic anhydrase inhibitors. Synthesis of water-soluble, topically effective, intraocular pressure-lowering aromatic/heterocyclic sulfonamides containing cationic or anionic moieties: is the tail more important than the ring? J Med Chem 42:2641-50 (1999)  
Target
Name:
Carbonic anhydrase 4
Synonyms:
CA-IV CAH4_BOVIN Carbonic Anhydrase IV Carbonic anhydrase 4
Type:
Enzyme
Mol. Mass.:
35152.74
Organism:
Bos taurus (bovine)
Description:
Bovine isozyme, isolated from lung microsomes
Residue:
312
  
Inhibitor
Name:
BDBM50079062
Synonyms:
6-[2-(2-Sulfamoyl-benzothiazol-6-yloxy)-ethoxycarbamoyl]-pyridine-2-carboxylic acid | CHEMBL89163
Type:
Small organic molecule
Emp. Form.:
C16H14N4O7S2
Mol. Mass.:
438.435
SMILES:
NS(=O)(=O)c1nc2ccc(OCCONC(=O)c3cccc(n3)C(O)=O)cc2s1
: