Target
Carbonic anhydrase 2
Ligand
BDBM50079041
Substrate
Meas. Tech.
ChEMBL_45077 (CHEMBL657148)
Ki
12±n/a nM
Citation
 Scozzafava, AMenabuoni, LMincione, FBriganti, FMincione, GSupuran, CT Carbonic anhydrase inhibitors. Synthesis of water-soluble, topically effective, intraocular pressure-lowering aromatic/heterocyclic sulfonamides containing cationic or anionic moieties: is the tail more important than the ring? J Med Chem 42:2641-50 (1999)  
Target
Name:
Carbonic anhydrase 2
Synonyms:
CA-II CAC Carbonate dehydratase II Carbonic anhydrase 2 (CA-II) Carbonic anhydrase C Carbonic anhydrase II (CA-II) Carbonic anhydrase II (hCA II) | Carbonic anhydrase isoenzyme II (hCA II)
Type:
Enzyme
Mol. Mass.:
29250.71
Organism:
Homo sapiens (Human)
Description:
P00918
Residue:
260
  
Inhibitor
Name:
BDBM50079041
Synonyms:
4,5-Dichloro-6-(5,7-dioxo-5,7-dihydro-pyrrolo[3,4-b]pyridin-6-yl)-benzene-1,3-disulfonic acid diamide CHEMBL432818
Type:
Small organic molecule
Emp. Form.:
C13H8Cl2N4O6S2
Mol. Mass.:
451.262
SMILES:
NS(=O)(=O)c1cc(c(N2C(=O)c3cccnc3C2=O)c(Cl)c1Cl)S(N)(=O)=O
: