Target
Carbonic anhydrase 4
Ligand
BDBM50079049
Substrate
Meas. Tech.
ChEMBL_45424 (CHEMBL657025)
Ki
15±n/a nM
Citation
 Scozzafava, AMenabuoni, LMincione, FBriganti, FMincione, GSupuran, CT Carbonic anhydrase inhibitors. Synthesis of water-soluble, topically effective, intraocular pressure-lowering aromatic/heterocyclic sulfonamides containing cationic or anionic moieties: is the tail more important than the ring? J Med Chem 42:2641-50 (1999)  
Target
Name:
Carbonic anhydrase 4
Synonyms:
CA-IV CAH4_BOVIN Carbonic Anhydrase IV Carbonic anhydrase 4
Type:
Enzyme
Mol. Mass.:
35152.74
Organism:
Bos taurus (bovine)
Description:
Bovine isozyme, isolated from lung microsomes
Residue:
312
  
Inhibitor
Name:
BDBM50079049
Synonyms:
6-(2-Hydroxy-ethoxy)-benzothiazole-2-sulfonic acid amide CHEMBL287117
Type:
Small organic molecule
Emp. Form.:
C9H10N2O4S2
Mol. Mass.:
274.317
SMILES:
NS(=O)(=O)c1nc2ccc(OCCO)cc2s1
: