Target
Carbonic anhydrase 4
Ligand
BDBM50079042
Substrate
Meas. Tech.
ChEMBL_45424 (CHEMBL657025)
Ki
10±n/a nM
Citation
 Scozzafava, AMenabuoni, LMincione, FBriganti, FMincione, GSupuran, CT Carbonic anhydrase inhibitors. Synthesis of water-soluble, topically effective, intraocular pressure-lowering aromatic/heterocyclic sulfonamides containing cationic or anionic moieties: is the tail more important than the ring? J Med Chem 42:2641-50 (1999)  
Target
Name:
Carbonic anhydrase 4
Synonyms:
CA-IV CAH4_BOVIN Carbonic Anhydrase IV Carbonic anhydrase 4
Type:
Enzyme
Mol. Mass.:
35152.74
Organism:
Bos taurus (bovine)
Description:
Bovine isozyme, isolated from lung microsomes
Residue:
312
  
Inhibitor
Name:
BDBM50079042
Synonyms:
3-(5,7-Dioxo-5,7-dihydro-pyrrolo[3,4-b]pyridin-6-yl)-N-(5-sulfamoyl-[1,3,4]thiadiazol-2-yl)-propionamide | CHEMBL90382
Type:
Small organic molecule
Emp. Form.:
C12H10N6O5S2
Mol. Mass.:
382.375
SMILES:
NS(=O)(=O)c1nnc(NC(=O)CCN2C(=O)c3cccnc3C2=O)s1
: