Target
Carbonic anhydrase 2
Ligand
BDBM50079033
Substrate
Meas. Tech.
ChEMBL_45077 (CHEMBL657148)
Ki
8±n/a nM
Citation
 Scozzafava, AMenabuoni, LMincione, FBriganti, FMincione, GSupuran, CT Carbonic anhydrase inhibitors. Synthesis of water-soluble, topically effective, intraocular pressure-lowering aromatic/heterocyclic sulfonamides containing cationic or anionic moieties: is the tail more important than the ring? J Med Chem 42:2641-50 (1999)  
Target
Name:
Carbonic anhydrase 2
Synonyms:
CA-II CAC Carbonate dehydratase II Carbonic anhydrase 2 (CA-II) Carbonic anhydrase C Carbonic anhydrase II (CA-II) Carbonic anhydrase II (hCA II) | Carbonic anhydrase isoenzyme II (hCA II)
Type:
Enzyme
Mol. Mass.:
29250.71
Organism:
Homo sapiens (Human)
Description:
P00918
Residue:
260
  
Inhibitor
Name:
BDBM50079033
Synonyms:
5-(5,7-Dioxo-5,7-dihydro-pyrrolo[3,4-b]pyridin-6-yl)-[1,3,4]thiadiazole-2-sulfonic acid amide | CHEMBL88232
Type:
Small organic molecule
Emp. Form.:
C9H5N5O4S2
Mol. Mass.:
311.297
SMILES:
NS(=O)(=O)c1nnc(s1)N1C(=O)c2cccnc2C1=O
: