Target
Gastrin/cholecystokinin type B receptor
Ligand
BDBM21147
Substrate
Meas. Tech.
ChEMBL_48584 (CHEMBL662464)
IC50
5.6±n/a nM
Citation
 Bartolomé-Nebreda, JMGómez-Monterrey, IGarcía-López, MTGonzález-Muñiz, RMartín-Martínez, MBallaz, SCenarruzabeitia, ELaTorre, MDel Río, JHerranz, R 5-(Tryptophyl)amino-1,3-dioxoperhydropyrido[1,2-c]pyrimidine-based potent and selective CCK(1) receptor antagonists: structural modifications at the tryptophan domain. J Med Chem 42:4659-68 (1999)  
Target
Name:
Gastrin/cholecystokinin type B receptor
Synonyms:
Cckbr Cholecystokinin B receptor GASR_RAT | Gastrin/cholecystokinin type B receptor
Type:
Enzyme Catalytic Domain
Mol. Mass.:
48980.43
Organism:
RAT
Description:
Cholecystokinin A CCKBR RAT::P30553
Residue:
452
  
Inhibitor
Name:
BDBM21147
Synonyms:
(3S)-3-[(2S)-2-[(2S)-2-{2-[(2S)-2-[(2S)-2-[(3S)-3-amino-3-formamidopropanoic acid]-3-[4-(sulfooxy)phenyl]propanamido]-4-(methylsulfanyl)butanamido]acetamido}-3-(1H-indol-3-yl)propanamido]-4-(methylsulfanyl)butanamido]-3-{[(1S)-1-carbamoyl-2-phenylethyl]carbamoyl}propanoic acid CCK-8(SO3) H-Asp-Tyr(SO3H)-Met-Gly-Trp-Met-Asp-Phe-NH2 Syncalide | [125I]CCK-8
Type:
radiolabeled ligand
Emp. Form.:
C49H62N10O16S3
Mol. Mass.:
1143.269
SMILES:
CSCC[C@H](NC(=O)[C@H](Cc1ccc(OS(O)(=O)=O)cc1)NC(=O)[C@@H](N)CC(O)=O)C(=O)NCC(=O)N[C@@H](Cc1c[nH]c2ccccc12)C(=O)N[C@@H](CCSC)C(=O)N[C@@H](CC(O)=O)C(=O)N[C@@H](Cc1ccccc1)C(N)=O
: