Target
cAMP-specific 3',5'-cyclic phosphodiesterase 4A/4B/4C/4D
Ligand
BDBM14361
Substrate
Meas. Tech.
ChEMBL_156907 (CHEMBL763941)
Ki
3.8±n/a nM
Citation
 Ukita, TSugahara, MTerakawa, YKuroda, TWada, KNakata, AOhmachi, YKikkawa, HIkezawa, KNaito, K Novel, potent, and selective phosphodiesterase-4 inhibitors as antiasthmatic agents: synthesis and biological activities of a series of 1-pyridylnaphthalene derivatives. J Med Chem 42:1088-99 (1999)  
Target
Name:
cAMP-specific 3',5'-cyclic phosphodiesterase 4A/4B/4C/4D
Synonyms:
Phosphodiesterase 4
Type:
Mol. Mass.:
Description:
ASSAY_ID of ChEMBL is 788178
Components:
This complex has 4 components.
Component 1
Name:
cAMP-specific 3',5'-cyclic phosphodiesterase 4A
Synonyms:
3',5'-cyclic phosphodiesterase PDE46 PDE4A_HUMAN Phosphodiesterase 4A | Phosphodiesterase 4A (PDE4)
Type:
Enzyme
Mol. Mass.:
98113.27
Organism:
Homo sapiens (Human)
Description:
P27815
Residue:
886
  
Component 2
Name:
cAMP-specific 3',5'-cyclic phosphodiesterase 4D
Synonyms:
3',5'-cyclic phosphodiesterase PDE43 PDE4D_HUMAN | Phosphodiesterase 4D
Type:
Protein
Mol. Mass.:
91092.69
Organism:
Homo sapiens (Human)
Description:
Q08499
Residue:
809
  
Component 3
Name:
cAMP-specific 3',5'-cyclic phosphodiesterase 4B
Synonyms:
3',5'-cyclic phosphodiesterase Isoform PDE4B1 PDE4B PDE4B_HUMAN Phosphodiesterase 4B (PDE4B) Phosphodiesterase Type 4 (PDE4B)
Type:
Protein
Mol. Mass.:
83318.87
Organism:
Homo sapiens (Human)
Description:
Q07343
Residue:
736
  
Component 4
Name:
cAMP-specific 3',5'-cyclic phosphodiesterase 4C
Synonyms:
3',5'-cyclic phosphodiesterase NP_000914.2 PDE4C | PDE4C1
Type:
Enzyme Catalytic Domain
Mol. Mass.:
79875.54
Organism:
Homo sapiens (Human)
Description:
Q08493
Residue:
712
  
Inhibitor
Name:
BDBM14361
Synonyms:
(R,S)-Rolipram 4-[3-(cyclopentyloxy)-4-methoxyphenyl]pyrrolidin-2-one CHEMBL63 | Rolipram
Type:
Small organic molecule
Emp. Form.:
C16H21NO3
Mol. Mass.:
275.3428
SMILES:
COc1ccc(cc1OC1CCCC1)C1CNC(=O)C1
: