Target
Adenosine receptor A2a
Ligand
BDBM50118812
Substrate
Meas. Tech.
ChEMBL_30019 (CHEMBL641310)
Ki
56±n/a nM
Citation
 de Zwart, MKourounakis, AKooijman, HSpek, ALLink, Rvon Frijtag Drabbe Künzel, JKIJzerman, AP 5'-N-substituted carboxamidoadenosines as agonists for adenosine receptors. J Med Chem 42:1384-92 (1999)  
Target
Name:
Adenosine receptor A2a
Synonyms:
AA2AR_RAT Adenosine A2 receptor Adenosine Receptors A2a (A2a) Adenosine receptors A2a Rat striatal adenosine A2a receptor
Type:
G Protein-Coupled Receptor (GPCR)
Mol. Mass.:
45015.65
Organism:
Rattus norvegicus (rat)
Description:
Rat A2A receptors expressed in CHO cells.
Residue:
410
  
Inhibitor
Name:
BDBM50118812
Synonyms:
(2S,3S,4R,5R)-3,4-Dihydroxy-5-[6-(3-iodo-benzylamino)-purin-9-yl]-tetrahydro-furan-2-carboxylic acid methylamide (2S,3S,4R,5R)-5-(6-(3-iodobenzylamino)-9H-purin-9-yl)-3,4-dihydroxy-N-methyl-tetrahydrofuran-2-carboxamide (3S,4R,5R)-3,4-Dihydroxy-5-[6-(3-iodo-benzylamino)-purin-9-yl]-tetrahydro-furan-2-carboxylic acid methylamide 3,4-Dihydroxy-5-[6-(3-iodo-benzylamino)-purin-9-yl]-tetrahydro-furan-2-carboxylic acid methylamide IB-MECA | N6-(3-iodobenzyl)-5'-N-methylcarboxamidoadenosine
Type:
Small organic molecule
Emp. Form.:
C18H19IN6O4
Mol. Mass.:
510.2857
SMILES:
CNC(=O)[C@H]1O[C@H]([C@H](O)[C@@H]1O)n1cnc2c(NCc3cccc(I)c3)ncnc12
: