Target
Adenosine receptor A1
Ligand
BDBM21220
Substrate
Meas. Tech.
ChEMBL_27580 (CHEMBL643502)
Ki
14±n/a nM
Citation
 de Zwart, MKourounakis, AKooijman, HSpek, ALLink, Rvon Frijtag Drabbe Künzel, JKIJzerman, AP 5'-N-substituted carboxamidoadenosines as agonists for adenosine receptors. J Med Chem 42:1384-92 (1999)  
Target
Name:
Adenosine receptor A1
Synonyms:
A1 adenosine receptor (hA1) AA1R_HUMAN ADORA1 Adenosine A1-receptor Adenosine receptor A1 (hA1) | Adenosine transporter (AdT)
Type:
G Protein-Coupled Receptor (GPCR)
Mol. Mass.:
36520.92
Organism:
Homo sapiens (Human)
Description:
P30542
Residue:
326
  
Inhibitor
Name:
BDBM21220
Synonyms:
(2S,3S,4R,5R)-5-(6-amino-9H-purin-9-yl)-N-ethyl-3,4-dihydroxyoxolane-2-carboxamide Adenosine, N6-Ethyl-carboxamido CHEMBL464859 NECA
Type:
Antineoplastic Agent
Emp. Form.:
C12H16N6O4
Mol. Mass.:
308.2932
SMILES:
CCNC(=O)[C@H]1O[C@H]([C@H](O)[C@@H]1O)n1cnc2c(N)ncnc12
: