Target
Progesterone receptor
Ligand
BDBM50067670
Substrate
Meas. Tech.
ChEMBL_159056 (CHEMBL760108)
EC50
51±n/a nM
Citation
 Zhi, LTegley, CMMarschke, KBMais, DEJones, TK 5-Aryl-1,2,3,4-tetrahydrochromeno[3,4-f]quinolin-3-ones as a novel class of nonsteroidal progesterone receptor agonists: effect of A-ring modification. J Med Chem 42:1466-72 (1999)  
Target
Name:
Progesterone receptor
Synonyms:
NR3C3 PGR PRGR_HUMAN | progesterone
Type:
Protein
Mol. Mass.:
98979.52
Organism:
Homo sapiens (Human)
Description:
P06401
Residue:
933
  
Inhibitor
Name:
BDBM50067670
Synonyms:
5-[1-(3-Fluoro-phenyl)-meth-(Z)-ylidene]-2,2,4-trimethyl-2,5-dihydro-1H-6-oxa-1-aza-chrysene | CHEMBL32812
Type:
Small organic molecule
Emp. Form.:
C26H22FNO
Mol. Mass.:
383.4574
SMILES:
CC1=CC(C)(C)Nc2ccc3-c4ccccc4O\C(=C/c4cccc(F)c4)c3c12
: