Target
Leukotriene B4 receptor 1
Ligand
BDBM50088244
Substrate
Meas. Tech.
ChEMBL_99832 (CHEMBL872555)
Ki
3.2±n/a nM
Citation
 Wintner, EAMoallemi, CC Quantized surface complementarity diversity (QSCD): a model based on small molecule-target complementarity. J Med Chem 43:1993-2006 (2000)  
Target
Name:
Leukotriene B4 receptor 1
Synonyms:
BLT BLTR Chemoattractant receptor-like 1 GPR16 LTB4-R 1 Leukotriene B4 R1 Leukotriene B4 receptor 1 P2Y purinoceptor 7 | P2Y7
Type:
Enzyme Catalytic Domain
Mol. Mass.:
37582.68
Organism:
Homo sapiens (Human)
Description:
Q15722
Residue:
352
  
Inhibitor
Name:
BDBM50088244
Synonyms:
7-[3-(2-Cyclopropylmethyl-3-methoxymethyl-4-thiazol-4-yl-phenoxy)-propoxy]-8-propyl-chroman-2-carboxylic acid | CHEMBL58495
Type:
Small organic molecule
Emp. Form.:
C31H37NO6S
Mol. Mass.:
551.694
SMILES:
CCCc1c(OCCCOc2ccc(-c3cscn3)c(COC)c2CC2CC2)ccc2CC[C@@H](Oc12)C(O)=O
: