Target
D(1A) dopamine receptor
Ligand
BDBM50088341
Substrate
Meas. Tech.
ChEMBL_58800 (CHEMBL667042)
Ki
0.08±n/a nM
Citation
 Witt, THock, FJLehmann, J 7-Methyl-6,7,8,9,14,15-hexahydro-5H-benz[d]indolo[2,3-g]azecine: a new heterocyclic system and a new lead compound for dopamine receptor antagonists. J Med Chem 43:2079-81 (2000)  
Target
Name:
D(1A) dopamine receptor
Synonyms:
DOPAMINE D1 Dopamine D1 high Dopamine receptor Dopamine1-like Drd1a
Type:
Enzyme Catalytic Domain
Mol. Mass.:
49429.75
Organism:
RAT
Description:
P18901
Residue:
446
  
Inhibitor
Name:
BDBM50088341
Synonyms:
11-methyl-11,21-diazatetracyclo[12.7.0.0^{3,8}.0^{15,20}]henicosa-1(14),3(8),4,6,15,17,19-heptaene 7-methyl-6,7,8,9,14,15-hexahydro-5H-benzo[7,8]azecino[5,4-b]indole(LE 300) CHEMBL441618 | LE 300
Type:
Small organic molecule
Emp. Form.:
C20H22N2
Mol. Mass.:
290.4021
SMILES:
CN1CCc2c(Cc3ccccc3CC1)[nH]c1ccccc21
: