Target
Bile acid receptor
Ligand
BDBM21724
Substrate
Meas. Tech.
ChEMBL_69701 (CHEMBL681097)
EC50
15±n/a nM
Citation
 Maloney, PRParks, DJHaffner, CDFivush, AMChandra, GPlunket, KDCreech, KLMoore, LBWilson, JGLewis, MCJones, SAWillson, TM Identification of a chemical tool for the orphan nuclear receptor FXR. J Med Chem 43:2971-4 (2000)  
Target
Name:
Bile acid receptor
Synonyms:
BAR FXR HRR1 NR1H4_HUMAN RIP14 Retinoid X receptor-interacting protein 14 | farnesoid x receptor
Type:
Nuclear Receptor
Mol. Mass.:
55916.24
Organism:
Homo sapiens (Human)
Description:
Q96RI1
Residue:
486
  
Inhibitor
Name:
BDBM21724
Synonyms:
3-[(E)-2-(2-chloro-4-{[3-(2,6-dichlorophenyl)-5-(1-methylethyl)isoxazol-4-yl]methoxy}phenyl)ethenyl]benzoic acid CHEMBL318457 | GW-4064
Type:
Small organic molecule
Emp. Form.:
C28H22Cl3NO4
Mol. Mass.:
542.838
SMILES:
CC(C)c1onc(c1COc1ccc(\C=C\c2cccc(c2)C(O)=O)c(Cl)c1)-c1c(Cl)cccc1Cl
: