Target
Prothrombin
Ligand
BDBM50366780
Substrate
Meas. Tech.
ChEMBL_208886 (CHEMBL814943)
Ki
3.6±n/a nM
Citation
 Leung, DAbbenante, GFairlie, DP Protease inhibitors: current status and future prospects. J Med Chem 43:305-41 (2000)  
Target
Name:
Prothrombin
Synonyms:
Activation peptide fragment 1 Coagulation factor II Prothrombin precursor Thrombin heavy chain | Thrombin light chain
Type:
Protein
Mol. Mass.:
70029.57
Organism:
Homo sapiens (Human)
Description:
P00734
Residue:
622
  
Inhibitor
Name:
BDBM50366780
Synonyms:
BMS-189090 | CHEMBL138877
Type:
Small organic molecule
Emp. Form.:
C25H34N6O5S
Mol. Mass.:
530.64
SMILES:
NC(=N)N1CCC[C@@H](C1)C(=O)NC[C@@H]1CCCN1C(=O)[C@H](CO)NS(=O)(=O)c1ccc2ccccc2c1
: