Target
Glyceraldehyde-3-phosphate dehydrogenase
Ligand
BDBM50100469
Substrate
Meas. Tech.
ChEMBL_72892 (CHEMBL684059)
IC50
7000±n/a nM
Citation
 Bressi, JCVerlinde, CLAronov, AMShaw, MLShin, SSNguyen, LNSuresh, SBuckner, FSVan Voorhis, WCKuntz, IDHol, WGGelb, MH Adenosine analogues as selective inhibitors of glyceraldehyde-3-phosphate dehydrogenase of Trypanosomatidae via structure-based drug design. J Med Chem 44:2080-93 (2001)  
Target
Name:
Glyceraldehyde-3-phosphate dehydrogenase
Synonyms:
G3P_HUMAN GAPDH | Glyceraldehyde-3-phosphate dehydrogenase liver
Type:
PROTEIN
Mol. Mass.:
36060.86
Organism:
Homo sapiens (Human)
Description:
ChEMBL_1511315
Residue:
335
  
Inhibitor
Name:
BDBM50100469
Synonyms:
CHEMBL303342 | N-(4-Hydroxy-5-hydroxymethyl-2-{6-[(3-methoxy-naphthalen-1-ylmethyl)-amino]-9H-purin-3-ylmethyl}-tetrahydro-furan-3-yl)-3,5-dimethoxy-benzamide
Type:
Small organic molecule
Emp. Form.:
C31H32N6O7
Mol. Mass.:
600.6218
SMILES:
COc1cc(OC)cc(c1)C(=O)N[C@@H]1[C@H](O)[C@@H](CO)O[C@H]1n1cnc2c(NCc3cc(OC)cc4ccccc34)ncnc12
: