Target
Glyceraldehyde-3-phosphate dehydrogenase, cytosolic
Ligand
BDBM50100494
Substrate
Meas. Tech.
ChEMBL_72768 (CHEMBL680373)
IC50
18000±n/a nM
Citation
 Bressi, JCVerlinde, CLAronov, AMShaw, MLShin, SSNguyen, LNSuresh, SBuckner, FSVan Voorhis, WCKuntz, IDHol, WGGelb, MH Adenosine analogues as selective inhibitors of glyceraldehyde-3-phosphate dehydrogenase of Trypanosomatidae via structure-based drug design. J Med Chem 44:2080-93 (2001)  
Target
Name:
Glyceraldehyde-3-phosphate dehydrogenase, cytosolic
Synonyms:
G3PC_LEIME GAPDH Glyceraldehyde-3-phosphate dehydrogenase, cytosolic
Type:
PROTEIN
Mol. Mass.:
35645.40
Organism:
Leishmania mexicana
Description:
ChEMBL_72768
Residue:
331
  
Inhibitor
Name:
BDBM50100494
Synonyms:
3,4-Dihydroxy-N-(4-hydroxy-5-hydroxymethyl-2-{6-[(naphthalen-1-ylmethyl)-amino]-9H-purin-3-ylmethyl}-tetrahydro-furan-3-yl)-benzamide | CHEMBL305307
Type:
Small organic molecule
Emp. Form.:
C28H26N6O6
Mol. Mass.:
542.5426
SMILES:
OC[C@H]1O[C@H]([C@H](NC(=O)c2ccc(O)c(O)c2)[C@@H]1O)n1cnc2c(NCc3cccc4ccccc34)ncnc12
: