Target
Glyceraldehyde-3-phosphate dehydrogenase, cytosolic
Ligand
BDBM50100475
Substrate
Meas. Tech.
ChEMBL_72768 (CHEMBL680373)
IC50
4000±n/a nM
Citation
 Bressi, JCVerlinde, CLAronov, AMShaw, MLShin, SSNguyen, LNSuresh, SBuckner, FSVan Voorhis, WCKuntz, IDHol, WGGelb, MH Adenosine analogues as selective inhibitors of glyceraldehyde-3-phosphate dehydrogenase of Trypanosomatidae via structure-based drug design. J Med Chem 44:2080-93 (2001)  
Target
Name:
Glyceraldehyde-3-phosphate dehydrogenase, cytosolic
Synonyms:
G3PC_LEIME GAPDH Glyceraldehyde-3-phosphate dehydrogenase, cytosolic
Type:
PROTEIN
Mol. Mass.:
35645.40
Organism:
Leishmania mexicana
Description:
ChEMBL_72768
Residue:
331
  
Inhibitor
Name:
BDBM50100475
Synonyms:
3-Chloro-N-(4-hydroxy-5-hydroxymethyl-2-{6-[(3-hydroxy-naphthalen-1-ylmethyl)-amino]-9H-purin-3-ylmethyl}-tetrahydro-furan-3-yl)-benzamide | CHEMBL303752
Type:
Small organic molecule
Emp. Form.:
C28H25ClN6O5
Mol. Mass.:
560.988
SMILES:
OC[C@H]1O[C@H]([C@H](NC(=O)c2cccc(Cl)c2)[C@@H]1O)n1cnc2c(NCc3cc(O)cc4ccccc34)ncnc12
: