Target
2-oxoglutarate receptor 1
Ligand
BDBM50409303
Substrate
Meas. Tech.
ChEMBL_151406 (CHEMBL754752)
Ki
55.6±n/a nM
Citation
 Umino, TYoshioka, KSaitoh, YMinakawa, NNakata, HMatsuda, A Nucleosides and nucleotides. 200. Reinvestigation of 5'-N-ethylcarboxamidoadenosine derivatives: structure-activity relationships for P(3) purinoceptor-like proteins. J Med Chem 44:208-14 (2001)  
Target
Name:
2-oxoglutarate receptor 1
Synonyms:
G protein-coupled receptor 80 OXGR1_RAT P2y15
Type:
PROTEIN
Mol. Mass.:
38385.93
Organism:
Rattus norvegicus
Description:
ChEMBL_151406
Residue:
337
  
Inhibitor
Name:
BDBM50409303
Synonyms:
CHEMBL2092773
Type:
Small organic molecule
Emp. Form.:
C17H24N6O4
Mol. Mass.:
376.4103
SMILES:
C[C@H]1CC[C@H](CC1)NC(=O)[C@H]1O[C@H]([C@H](O)[C@@H]1O)n1cnc2c(N)ncnc12
: