Target
Adenosine receptor A1
Ligand
BDBM50106542
Substrate
Meas. Tech.
ChEMBL_29013 (CHEMBL643487)
Ki
6.69±n/a nM
Citation
 Jacobson, KAGao, ZGChen, ABarak, DKim, SALee, KLink, ARompaey, PVvan Calenbergh, SLiang, BT Neoceptor concept based on molecular complementarity in GPCRs: a mutant adenosine A(3) receptor with selectively enhanced affinity for amine-modified nucleosides. J Med Chem 44:4125-36 (2001)  
Target
Name:
Adenosine receptor A1
Synonyms:
AA1R_RAT ADENOSINE A1 high Adenosine A1 receptor (A1) Adenosine receptors A1 | Adora1
Type:
Protein
Mol. Mass.:
36704.13
Organism:
Rattus norvegicus (rat)
Description:
Residue:
326
  
Inhibitor
Name:
BDBM50106542
Synonyms:
4-Amino-5-[2-chloro-6-(3-iodo-benzylamino)-purin-9-yl]-tetrahydro-furan-2-carboxylic acid methylamide | CHEMBL439976
Type:
Small organic molecule
Emp. Form.:
C18H19ClIN7O2
Mol. Mass.:
527.747
SMILES:
CNC(=O)[C@@H]1C[C@H](N)[C@@H](O1)n1cnc2c(NCc3cccc(I)c3)nc(Cl)nc12
: