Target
Adenosine receptor A3
Ligand
BDBM50106537
Substrate
Meas. Tech.
ChEMBL_31710 (CHEMBL873053)
Ki
9.9±n/a nM
Citation
 Jacobson, KAGao, ZGChen, ABarak, DKim, SALee, KLink, ARompaey, PVvan Calenbergh, SLiang, BT Neoceptor concept based on molecular complementarity in GPCRs: a mutant adenosine A(3) receptor with selectively enhanced affinity for amine-modified nucleosides. J Med Chem 44:4125-36 (2001)  
Target
Name:
Adenosine receptor A3
Synonyms:
A3 adenosine receptor (hA3) ADORA3 | Adenosine A3 receptor (A3AR)
Type:
G Protein-Coupled Receptor (GPCR)
Mol. Mass.:
36197.32
Organism:
Homo sapiens (Human)
Description:
P0DMS8
Residue:
318
  
Inhibitor
Name:
BDBM50106537
Synonyms:
4-[2-Chloro-6-(3-iodo-benzylamino)-purin-9-yl]-2,3-dihydroxy-bicyclo[3.1.0]hexane-1-carboxylic acid methylamide | CHEMBL133387
Type:
Small organic molecule
Emp. Form.:
C20H20ClIN6O3
Mol. Mass.:
554.769
SMILES:
CNC(=O)C12CC1C(C(O)C2O)n1cnc2c(NCc3cccc(I)c3)nc(Cl)nc12
: