Target
Adenosine receptor A1
Ligand
BDBM50097439
Substrate
Meas. Tech.
ChEMBL_29483 (CHEMBL641717)
Ki
1200±n/a nM
Citation
 van Muijlwijk-Koezen, JETimmerman, HVollinga, RCFrijtag von Drabbe Künzel, Jde Groote, MVisser, SIJzerman, AP Thiazole and thiadiazole analogues as a novel class of adenosine receptor antagonists. J Med Chem 44:749-62 (2001)  
Target
Name:
Adenosine receptor A1
Synonyms:
AA1R_RAT ADENOSINE A1 high Adenosine A1 receptor (A1) Adenosine receptors A1 | Adora1
Type:
Protein
Mol. Mass.:
36704.13
Organism:
Rattus norvegicus (rat)
Description:
Residue:
326
  
Inhibitor
Name:
BDBM50097439
Synonyms:
CHEMBL163248 | N-(3-Phenyl-isoquinolin-1-yl)-benzamide
Type:
Small organic molecule
Emp. Form.:
C22H16N2O
Mol. Mass.:
324.3752
SMILES:
O=C(Nc1nc(cc2ccccc12)-c1ccccc1)c1ccccc1
: