Target
Chymase
Ligand
BDBM50098847
Substrate
Meas. Tech.
ChEMBL_197665 (CHEMBL807474)
Ki
103±n/a nM
Citation
 Akahoshi, FAshimori, ASakashita, HYoshimura, TImada, TNakajima, MMitsutomi, NKuwahara, SOhtsuka, TFukaya, CMiyazaki, MNakamura, N Synthesis, structure-activity relationships, and pharmacokinetic profiles of nonpeptidic alpha-keto heterocycles as novel inhibitors of human chymase. J Med Chem 44:1286-96 (2001)  
Target
Name:
Chymase
Synonyms:
CMA1_RAT Mast cell protease 3 | Mcpt3
Type:
PROTEIN
Mol. Mass.:
27587.00
Organism:
Rattus norvegicus
Description:
ChEMBL_197666
Residue:
247
  
Inhibitor
Name:
BDBM50098847
Synonyms:
2-(2-{2-[5-Amino-2-(4-fluoro-phenyl)-6-oxo-6H-pyrimidin-1-yl]-acetylamino}-3-phenyl-propionyl)-benzooxazole-5-carboxylic acid methyl ester | CHEMBL281124
Type:
Small organic molecule
Emp. Form.:
C30H24FN5O6
Mol. Mass.:
569.5399
SMILES:
COC(=O)c1ccc2oc(nc2c1)C(=O)C(Cc1ccccc1)NC(=O)Cn1c(ncc(N)c1=O)-c1ccc(F)cc1
: