Target
Mast cell protease 9
Ligand
BDBM50098874
Substrate
Meas. Tech.
ChEMBL_217041 (CHEMBL821575)
Ki
1260±n/a nM
Citation
 Akahoshi, FAshimori, ASakashita, HYoshimura, TEda, MImada, TNakajima, MMitsutomi, NKuwahara, SOhtsuka, TFukaya, CMiyazaki, MNakamura, N Synthesis, structure-activity relationships, and pharmacokinetic profiles of nonpeptidic difluoromethylene ketones as novel inhibitors of human chymase. J Med Chem 44:1297-304 (2001)  
Target
Name:
Mast cell protease 9
Synonyms:
MCPT9_MOUSE Mcpt9
Type:
PROTEIN
Mol. Mass.:
26672.66
Organism:
Mus musculus
Description:
ChEMBL_217041
Residue:
246
  
Inhibitor
Name:
BDBM50098874
Synonyms:
4-{2-[5-Amino-2-(3-chloro-phenyl)-6-oxo-6H-pyrimidin-1-yl]-acetylamino}-2,2-difluoro-3-oxo-5-phenyl-pentanoic acid benzylamide | CHEMBL24734
Type:
Small organic molecule
Emp. Form.:
C30H26ClF2N5O4
Mol. Mass.:
594.008
SMILES:
Nc1cnc(-c2cccc(Cl)c2)n(CC(=O)NC(Cc2ccccc2)C(=O)C(F)(F)C(=O)NCc2ccccc2)c1=O
: