Target
Vesicular glutamate transporter 3
Ligand
BDBM50366944
Substrate
Meas. Tech.
ChEMBL_213566 (CHEMBL816123)
Ki
40±n/a nM
Citation
 Carrigan, CNBartlett, RDEsslinger, CSCybulski, KATongcharoensirikul, PBridges, RJThompson, CM Synthesis and in vitro pharmacology of substituted quinoline-2,4-dicarboxylic acids as inhibitors of vesicular glutamate transport. J Med Chem 45:2260-76 (2002)  
Target
Name:
Vesicular glutamate transporter 3
Synonyms:
Slc17a8 Vglut3
Type:
PROTEIN
Mol. Mass.:
64750.88
Organism:
Rattus norvegicus
Description:
ChEMBL_213568
Residue:
588
  
Inhibitor
Name:
BDBM50366944
Synonyms:
Azovan Blue EVANS BLUE
Type:
Small organic molecule
Emp. Form.:
C34H24N6O14S4
Mol. Mass.:
868.848
SMILES:
Cc1cc(ccc1N=Nc1ccc2c(cc(c(N)c2c1O)S([O-])(=O)=O)S([O-])(=O)=O)-c1ccc(N=Nc2ccc3c(cc(c(N)c3c2O)S([O-])(=O)=O)S([O-])(=O)=O)c(C)c1
: