Target
Seed linoleate 13S-lipoxygenase-1
Ligand
BDBM50065995
Substrate
Meas. Tech.
ChEMBL_169 (CHEMBL615381)
IC50
3100±n/a nM
Citation
 Whitman, SGezginci, MTimmermann, BNHolman, TR Structure-activity relationship studies of nordihydroguaiaretic acid inhibitors toward soybean, 12-human, and 15-human lipoxygenase. J Med Chem 45:2659-61 (2002)  
Target
Name:
Seed linoleate 13S-lipoxygenase-1
Synonyms:
15-LOX 15-lipo-oxygenase (SLO) L-1 LOX1.1 Lipoxygenase (LOX) Lipoxygenase-1 | Seed lipoxygenase-1
Type:
Enzyme
Mol. Mass.:
94365.66
Organism:
Glycine max (soybean)
Description:
Residue:
839
  
Inhibitor
Name:
BDBM50065995
Synonyms:
4-[(2S,3R)-4-(3,4-Dimethoxy-phenyl)-2,3-dimethyl-butyl]-benzene-1,2-diol CHEMBL91531
Type:
Small organic molecule
Emp. Form.:
C20H26O4
Mol. Mass.:
330.418
SMILES:
COc1ccc(C[C@@H](C)[C@@H](C)Cc2ccc(O)c(O)c2)cc1OC
: