Target
P2X purinoceptor 3
Ligand
BDBM50118217
Substrate
Meas. Tech.
ChEMBL_147403 (CHEMBL884064)
EC50
690±n/a nM
Citation
 Jacobson, KAJarvis, MFWilliams, M Purine and pyrimidine (P2) receptors as drug targets. J Med Chem 45:4057-93 (2002)  
Target
Name:
P2X purinoceptor 3
Synonyms:
ATP receptor P2RX3 P2X purinoceptor 3 P2X purinoceptor 3 (P2X3) P2X3 purinoceptor p2x3 + hsa
Type:
Protein
Mol. Mass.:
44292.02
Organism:
Homo sapiens (Human)
Description:
P56373
Residue:
397
  
Inhibitor
Name:
BDBM50118217
Synonyms:
ADENOSINE-5'-DIPHOSPHATE MONOTHIOPHOSPHATE ATPgammaS PHOSPHOTHIOPHOSPHORIC ACID-ADENYLATE ESTER
Type:
Small organic molecule
Emp. Form.:
C10H16N5O12P3S
Mol. Mass.:
523.247
SMILES:
Nc1ncnc2n(cnc12)[C@@H]1O[C@H](COP(O)(=O)OP(O)(=O)OP(O)(S)=O)[C@@H](O)[C@H]1O
: