Target
Carbonic anhydrase 4
Ligand
BDBM50108567
Substrate
Meas. Tech.
ChEMBL_45269 (CHEMBL658221)
Ki
6±n/a nM
Citation
 Masereel, BRolin, SAbbate, FScozzafava, ASupuran, CT Carbonic anhydrase inhibitors: anticonvulsant sulfonamides incorporating valproyl and other lipophilic moieties. J Med Chem 45:312-20 (2002)  
Target
Name:
Carbonic anhydrase 4
Synonyms:
CA-IV CAH4_BOVIN Carbonic Anhydrase IV Carbonic anhydrase 4
Type:
Enzyme
Mol. Mass.:
35152.74
Organism:
Bos taurus (bovine)
Description:
Bovine isozyme, isolated from lung microsomes
Residue:
312
  
Inhibitor
Name:
BDBM50108567
Synonyms:
5-Phenylmethanesulfonylamino-[1,3,4]thiadiazole-2-sulfonic acid amide CHEMBL108982
Type:
Small organic molecule
Emp. Form.:
C9H10N4O4S3
Mol. Mass.:
334.395
SMILES:
NS(=O)(=O)c1nnc(NS(=O)(=O)Cc2ccccc2)s1
: