Target
Carbonic anhydrase 2
Ligand
BDBM50108571
Substrate
Meas. Tech.
ChEMBL_45048 (CHEMBL658046)
Ki
7±n/a nM
Citation
 Masereel, BRolin, SAbbate, FScozzafava, ASupuran, CT Carbonic anhydrase inhibitors: anticonvulsant sulfonamides incorporating valproyl and other lipophilic moieties. J Med Chem 45:312-20 (2002)  
Target
Name:
Carbonic anhydrase 2
Synonyms:
CA-II CAC Carbonate dehydratase II Carbonic anhydrase 2 (CA-II) Carbonic anhydrase C Carbonic anhydrase II (CA-II) Carbonic anhydrase II (hCA II) | Carbonic anhydrase isoenzyme II (hCA II)
Type:
Enzyme
Mol. Mass.:
29250.71
Organism:
Homo sapiens (Human)
Description:
P00918
Residue:
260
  
Inhibitor
Name:
BDBM50108571
Synonyms:
2-Propyl-pentanoic acid 2-(2-sulfamoyl-benzothiazol-6-yloxy)-ethyl ester | CHEMBL108381
Type:
Small organic molecule
Emp. Form.:
C17H24N2O5S2
Mol. Mass.:
400.513
SMILES:
CCCC(CCC)C(=O)OCCOc1ccc2nc(sc2c1)S(N)(=O)=O
: