Target
Adenosine receptor A3
Ligand
BDBM50088422
Substrate
Meas. Tech.
ChEMBL_31703 (CHEMBL645784)
Ki
5.8±n/a nM
Citation
 Gao, ZGKim, SKBiadatti, TChen, WLee, KBarak, DKim, SGJohnson, CRJacobson, KA Structural determinants of A(3) adenosine receptor activation: nucleoside ligands at the agonist/antagonist boundary. J Med Chem 45:4471-84 (2002)  
Target
Name:
Adenosine receptor A3
Synonyms:
A3 adenosine receptor (hA3) ADORA3 | Adenosine A3 receptor (A3AR)
Type:
G Protein-Coupled Receptor (GPCR)
Mol. Mass.:
36197.32
Organism:
Homo sapiens (Human)
Description:
P0DMS8
Residue:
318
  
Inhibitor
Name:
BDBM50088422
Synonyms:
(2R,3R,4S,5R)-2-(6-(3-iodobenzylamino)-9H-purin-9-yl)-5-(hydroxymethyl)-tetrahydrofuran-3,4-diol 2-Hydroxymethyl-5-[6-(3-iodo-benzylamino)-purin-9-yl]-tetrahydro-furan-3,4-diol | CHEMBL66393
Type:
Small organic molecule
Emp. Form.:
C17H18IN5O4
Mol. Mass.:
483.2604
SMILES:
OC[C@H]1O[C@H]([C@H](O)[C@@H]1O)n1cnc2c(NCc3cccc(I)c3)ncnc12
: