Target
Adenosine receptor A3
Ligand
BDBM50118808
Substrate
Meas. Tech.
ChEMBL_30468 (CHEMBL643129)
Ki
2.9±n/a nM
Citation
 Gao, ZGKim, SKBiadatti, TChen, WLee, KBarak, DKim, SGJohnson, CRJacobson, KA Structural determinants of A(3) adenosine receptor activation: nucleoside ligands at the agonist/antagonist boundary. J Med Chem 45:4471-84 (2002)  
Target
Name:
Adenosine receptor A3
Synonyms:
AA3R_RAT Adenosine receptor A2a and A3 | Adora3
Type:
PROTEIN
Mol. Mass.:
36643.73
Organism:
Rattus norvegicus
Description:
ChEMBL_479910
Residue:
320
  
Inhibitor
Name:
BDBM50118808
Synonyms:
4-[2-Chloro-6-(3-iodo-benzylamino)-purin-9-yl]-1-hydroxymethyl-bicyclo[3.1.0]hexane-2,3-diol | CHEMBL342873
Type:
Small organic molecule
Emp. Form.:
C19H19ClIN5O3
Mol. Mass.:
527.743
SMILES:
OCC12CC1C(C(O)C2O)n1cnc2c(NCc3cccc(I)c3)nc(Cl)nc12
: