Target
Adenosine receptor A3
Ligand
BDBM50074225
Substrate
Meas. Tech.
ChEMBL_30636 (CHEMBL875922)
Ki
238±n/a nM
Citation
 Gao, ZGKim, SKBiadatti, TChen, WLee, KBarak, DKim, SGJohnson, CRJacobson, KA Structural determinants of A(3) adenosine receptor activation: nucleoside ligands at the agonist/antagonist boundary. J Med Chem 45:4471-84 (2002)  
Target
Name:
Adenosine receptor A3
Synonyms:
A3 adenosine receptor (hA3) ADORA3 | Adenosine A3 receptor (A3AR)
Type:
G Protein-Coupled Receptor (GPCR)
Mol. Mass.:
36197.32
Organism:
Homo sapiens (Human)
Description:
P0DMS8
Residue:
318
  
Inhibitor
Name:
BDBM50074225
Synonyms:
6-Ethyl-5-ethylsulfanylcarbonyl-2-phenyl-4-propyl-nicotinic acid propyl ester | CHEMBL111545
Type:
Small organic molecule
Emp. Form.:
C23H29NO3S
Mol. Mass.:
399.546
SMILES:
CCCOC(=O)c1c(CCC)c(C(=O)SCC)c(CC)nc1-c1ccccc1
: