Target
ATP-dependent translocase ABCB1
Ligand
BDBM50119396
Substrate
Meas. Tech.
ChEMBL_147866 (CHEMBL755182)
IC50
2300±n/a nM
Citation
 Loor, FTiberghien, FWenandy, TDidier, ATraber, R Cyclosporins: structure-activity relationships for the inhibition of the human MDR1 P-glycoprotein ABC transporter. J Med Chem 45:4598-612 (2002)  
Target
Name:
ATP-dependent translocase ABCB1
Synonyms:
ABCB1 MDR1_HUMAN Multidrug resistance protein 1 P-glycoprotein (P-gp) PGY1
Type:
Protein
Mol. Mass.:
141503.50
Organism:
Homo sapiens (Human)
Description:
P08183
Residue:
1280
  
Inhibitor
Name:
BDBM50119396
Synonyms:
27-Ethyl-30-(1-hydroxy-2-methyl-hex-4-enyl)-3,6,15,21-tetraisobutyl-18,33-diisopropyl-1,4,7,9,12,16,22,25-octamethyl-1,4,7,10,13,16,19,22,25,28,31undecaaza-cyclotritriacontan-2,5,8,11,14,17,20,23,26,29,32-undecaone cyclo-[Bmt-Abu-MeGly-MeLeu-Val-MeLeu-Ala-D-Ala-MeLeu-MeLeu-MeVal]27-Ethyl-30-(1-hydroxy-2-methyl-hex-4-enyl)-3,6,15,21-tetraisobutyl-18,33-diisopropyl-1,4,7,9,12,16,22,25-octamethyl-1,4,7,10,13,16,19,22,25,28,31undecaaza-cyclotritriacontan-2,5,8,11,14,17,20,23,26,29,32-undecaone
Type:
Small organic molecule
Emp. Form.:
C61H109N11O12
Mol. Mass.:
1188.5847
SMILES:
CCC1NC(=O)C(NC(=O)[C@H](C(C)C)N(C)C(=O)[C@H](CC(C)C)N(C)C(=O)[C@H](CC(C)C)N(C)C(=O)[C@@H](C)NC(=O)C(C)NC(=O)[C@@H](CC(C)C)N(C)C(=O)[C@H](NC(=O)[C@@H](CC(C)C)N(C)C(=O)CN(C)C1=O)C(C)C)[C@H](O)[C@H](C)C\C=C\C
: