Target
Adenosine receptor A1
Ligand
BDBM50069319
Substrate
Meas. Tech.
ChEMBL_29124 (CHEMBL642428)
Ki
4.2±n/a nM
Citation
 Bondavalli, FBotta, MBruno, OCiacci, ACorelli, FFossa, PLucacchini, AManetti, FMartini, CMenozzi, GMosti, LRanise, ASchenone, STafi, ATrincavellic, ML Synthesis, molecular modeling studies, and pharmacological activity of selective A(1) receptor antagonists. J Med Chem 45:4875-87 (2002)  
Target
Name:
Adenosine receptor A1
Synonyms:
AA1R_BOVIN ADENOSINE A1 high ADORA1 | Adenosine A1 receptor
Type:
Enzyme Catalytic Domain
Mol. Mass.:
36602.99
Organism:
BOVINE
Description:
ADENOSINE 0 BOVINE::P28190
Residue:
326
  
Inhibitor
Name:
BDBM50069319
Synonyms:
(2R,3R,4S,5R)-2-(6-Amino-purin-9-yl)-5-(1-methyl-1-phenyl-ethoxymethyl)-tetrahydro-furan-3,4-diol CHEMBL146549
Type:
Small organic molecule
Emp. Form.:
C19H23N5O4
Mol. Mass.:
385.417
SMILES:
CC(C)(OC[C@H]1O[C@H]([C@H](O)[C@@H]1O)n1cnc2c(N)ncnc12)c1ccccc1
: