Target
Kappa-type opioid receptor
Ligand
BDBM50026994
Substrate
Meas. Tech.
ChEMBL_146796 (CHEMBL753583)
Ki
>10000±n/a nM
Citation
 Schütz, JDersch, CMHorel, RSpetea, MKoch, MMeditz, RGreiner, ERothman, RBSchmidhammer, H Synthesis and biological evaluation of 14-alkoxymorphinans. 17. Highly delta opioid receptor selective 14-alkoxy-substituted indolo- and benzofuromorphinans. J Med Chem 45:5378-83 (2002)  
Target
Name:
Kappa-type opioid receptor
Synonyms:
Kappa Opioid Receptor OPRK1 Opiate Kappa 1 | mu/kappa opioid receptor
Type:
G Protein-Coupled Receptor (GPCR)
Mol. Mass.:
42744.99
Organism:
Cavia porcellus (domestic guinea pig)
Description:
P41144
Residue:
380
  
Inhibitor
Name:
BDBM50026994
Synonyms:
CHEMBL2113646
Type:
Small organic molecule
Emp. Form.:
C28H29NO4
Mol. Mass.:
443.5342
SMILES:
[H][C@@]12Oc3c4c(C[C@@]5([H])N(CC6CC6)CC[C@@]14[C@]5(Cc1c2oc2ccccc12)OCC)ccc3O
: