Target
Kappa-type opioid receptor
Ligand
BDBM50026995
Substrate
Meas. Tech.
ChEMBL_146791 (CHEMBL754453)
Ki
68±n/a nM
Citation
 Schütz, JDersch, CMHorel, RSpetea, MKoch, MMeditz, RGreiner, ERothman, RBSchmidhammer, H Synthesis and biological evaluation of 14-alkoxymorphinans. 17. Highly delta opioid receptor selective 14-alkoxy-substituted indolo- and benzofuromorphinans. J Med Chem 45:5378-83 (2002)  
Target
Name:
Kappa-type opioid receptor
Synonyms:
Kappa Opioid Receptor OPRK1 Opiate Kappa 1 | mu/kappa opioid receptor
Type:
G Protein-Coupled Receptor (GPCR)
Mol. Mass.:
42744.99
Organism:
Cavia porcellus (domestic guinea pig)
Description:
P41144
Residue:
380
  
Inhibitor
Name:
BDBM50026995
Synonyms:
CHEMBL2113653
Type:
Small organic molecule
Emp. Form.:
C27H27NO4
Mol. Mass.:
429.5076
SMILES:
[H][C@@]12Oc3c4c(C[C@@]5([H])N(CC=C)CC[C@@]14[C@]5(Cc1c2oc2ccccc12)OCC)ccc3O
: