Target
D(3) dopamine receptor
Ligand
BDBM50084494
Substrate
Meas. Tech.
ChEMBL_62757 (CHEMBL676126)
Ki
0.41±n/a nM
Citation
 Leopoldo, MBerardi, FColabufo, NADe Giorgio, PLacivita, EPerrone, RTortorella, V Structure-affinity relationship study on N-[4-(4-arylpiperazin-1-yl)butyl]arylcarboxamides as potent and selective dopamine D(3) receptor ligands. J Med Chem 45:5727-35 (2002)  
Target
Name:
D(3) dopamine receptor
Synonyms:
DOPAMINE D3 Dopamine D3 receptor | Drd3
Type:
Protein
Mol. Mass.:
49540.58
Organism:
Rattus norvegicus (Rat)
Description:
P19020
Residue:
446
  
Inhibitor
Name:
BDBM50084494
Synonyms:
CHEMBL315879 N-{4-[4-(4-Chloro-phenyl)-piperazin-1-yl]-butyl}-3-methoxy-benzamide (HCL .5/4H2O)
Type:
Small organic molecule
Emp. Form.:
C22H28ClN3O2
Mol. Mass.:
401.93
SMILES:
COc1cccc(c1)C(=O)NCCCCN1CCN(CC1)c1ccc(Cl)cc1
: