Target
5-hydroxytryptamine receptor 1A
Ligand
BDBM50122055
Substrate
Meas. Tech.
ChEMBL_1112 (CHEMBL616057)
Ki
4.5±n/a nM
Citation
 Leopoldo, MBerardi, FColabufo, NADe Giorgio, PLacivita, EPerrone, RTortorella, V Structure-affinity relationship study on N-[4-(4-arylpiperazin-1-yl)butyl]arylcarboxamides as potent and selective dopamine D(3) receptor ligands. J Med Chem 45:5727-35 (2002)  
Target
Name:
5-hydroxytryptamine receptor 1A
Synonyms:
5-HT-1A 5-HT1A 5-hydroxytryptamine receptor 1A (5HT1A) 5ht1a Htr1a Serotonin 1a (5-HT1a) receptor/Adrenergic receptor alpha-1 | Serotonin receptor 1A
Type:
G Protein-Coupled Receptor (GPCR)
Mol. Mass.:
46445.29
Organism:
Rattus norvegicus (rat)
Description:
Binding assays were performed using rat hippocampal membranes.
Residue:
422
  
Inhibitor
Name:
BDBM50122055
Synonyms:
3-Methoxy-N-{5-[4-(2-methoxy-phenyl)-piperazin-1-yl]-pentyl}-benzamide | CHEMBL152869
Type:
Small organic molecule
Emp. Form.:
C24H33N3O3
Mol. Mass.:
411.5371
SMILES:
COc1cccc(c1)C(=O)NCCCCCN1CCN(CC1)c1ccccc1OC
: