Target
Stromelysin-1
Ligand
BDBM50109617
Substrate
Meas. Tech.
ChEMBL_104748 (CHEMBL715873)
Ki
12.8±n/a nM
Citation
 Sawa, MKiyoi, TKurokawa, KKumihara, HYamamoto, MMiyasaka, TIto, YHirayama, RInoue, TKirii, YNishiwaki, EOhmoto, HMaeda, YIshibushi, EInoue, YYoshino, KKondo, H New type of metalloproteinase inhibitor: design and synthesis of new phosphonamide-based hydroxamic acids. J Med Chem 45:919-29 (2002)  
Target
Name:
Stromelysin-1
Synonyms:
MMP-3 MMP3_HUMAN Matrix metalloproteinase 3 Matrix metalloproteinase-3 (MMP-3) SL-1 Stromelysin 1 | Transin-1
Type:
Enzyme
Mol. Mass.:
53973.13
Organism:
Homo sapiens (Human)
Description:
P08254
Residue:
477
  
Inhibitor
Name:
BDBM50109617
Synonyms:
(3-Hydroxycarbamoyl-3,4-dihydro-1H-isoquinolin-2-yl)-(4-methoxy-phenyl)-phosphinic acid 2-biphenyl-4-yl-ethyl ester | CHEMBL173754
Type:
Small organic molecule
Emp. Form.:
C31H31N2O5P
Mol. Mass.:
542.562
SMILES:
COc1ccc(cc1)P(=O)(OCCc1ccc(cc1)-c1ccccc1)N1Cc2ccccc2CC1C(=O)NO
: