Target
5-hydroxytryptamine receptor 7
Ligand
BDBM50007407
Substrate
Meas. Tech.
ChEMBL_3688 (CHEMBL620823)
Ki
83±n/a nM
Citation
 Glennon, RA Higher-end serotonin receptors: 5-HT(5), 5-HT(6), and 5-HT(7). J Med Chem 46:2795-812 (2003)  
Target
Name:
5-hydroxytryptamine receptor 7
Synonyms:
5-HT-7 5-HT7 5-HT7S 5HT7 HTR7 | Serotonin receptor 7
Type:
G Protein-Coupled Receptor (GPCR)
Mol. Mass.:
53573.08
Organism:
Homo sapiens (Human)
Description:
P34969
Residue:
479
  
Inhibitor
Name:
BDBM50007407
Synonyms:
1-NP 4-Naphthalen-1-yl-piperazin-1-ium | CHEMBL277120
Type:
Small organic molecule
Emp. Form.:
C14H16N2
Mol. Mass.:
212.2902
SMILES:
C1CN(CCN1)c1cccc2ccccc12
: