Target
5-hydroxytryptamine receptor 2C
Ligand
BDBM50122808
Substrate
Meas. Tech.
ChEMBL_2956 (CHEMBL617896)
Ki
>4200±n/a nM
Citation
 Balle, TPerregaard, JRamirez, MTLarsen, AKSøby, KKLiljefors, TAndersen, K Synthesis and structure-affinity relationship investigations of 5-heteroaryl-substituted analogues of the antipsychotic sertindole. A new class of highly selective alpha(1) adrenoceptor antagonists. J Med Chem 46:265-83 (2003)  
Target
Name:
5-hydroxytryptamine receptor 2C
Synonyms:
5-HT-1C 5-HT1C 5-HT2C-INI 5-HTR2C 5-hydroxytryptamine receptor 2C (5-HT-2C) 5HT-1C HTR1C Serotonin (5-HT3) receptor Serotonin Receptor 2C
Type:
G Protein-Coupled Receptor (GPCR)
Mol. Mass.:
51836.79
Organism:
Homo sapiens (Human)
Description:
P28335
Residue:
458
  
Inhibitor
Name:
BDBM50122808
Synonyms:
3-(2-{4-[1-(4-Fluoro-phenyl)-5-pyrimidin-2-yl-1H-indol-3-yl]-piperidin-1-yl}-ethyl)-oxazolidin-2-one | CHEMBL95175
Type:
Small organic molecule
Emp. Form.:
C28H28FN5O2
Mol. Mass.:
485.5526
SMILES:
Fc1ccc(cc1)-n1cc(C2CCN(CCN3CCOC3=O)CC2)c2cc(ccc12)-c1ncccn1
: