Target
Alpha-1D adrenergic receptor
Ligand
BDBM50122815
Substrate
Meas. Tech.
ChEMBL_32720 (CHEMBL645992)
Ki
2±n/a nM
Citation
 Balle, TPerregaard, JRamirez, MTLarsen, AKSøby, KKLiljefors, TAndersen, K Synthesis and structure-affinity relationship investigations of 5-heteroaryl-substituted analogues of the antipsychotic sertindole. A new class of highly selective alpha(1) adrenoceptor antagonists. J Med Chem 46:265-83 (2003)  
Target
Name:
Alpha-1D adrenergic receptor
Synonyms:
ADA1D_RAT Adra1d Alpha-1D adrenergic receptor | Serotonin 1a (5-HT1a) receptor/Adrenergic receptor alpha-1
Type:
Protein
Mol. Mass.:
59375.97
Organism:
Rattus norvegicus (Rat)
Description:
P23944
Residue:
561
  
Inhibitor
Name:
BDBM50122815
Synonyms:
1-(2-{4-[1-(4-Fluoro-phenyl)-5-(2-methyl-2H-tetrazol-5-yl)-1H-indol-3-yl]-piperidin-1-yl}-ethyl)-imidazolidin-2-one | CHEMBL319352
Type:
Small organic molecule
Emp. Form.:
C26H29FN8O
Mol. Mass.:
488.5599
SMILES:
Cn1nnc(n1)-c1ccc2n(cc(C3CCN(CCN4CCNC4=O)CC3)c2c1)-c1ccc(F)cc1
: