Target
D(3) dopamine receptor
Ligand
BDBM50054067
Substrate
Meas. Tech.
ChEMBL_62280 (CHEMBL675050)
Ki
2.2±n/a nM
Citation
 Varady, JWu, XFang, XMin, JHu, ZLevant, BWang, S Molecular modeling of the three-dimensional structure of dopamine 3 (D3) subtype receptor: discovery of novel and potent D3 ligands through a hybrid pharmacophore- and structure-based database searching approach. J Med Chem 46:4377-92 (2003)  
Target
Name:
D(3) dopamine receptor
Synonyms:
DOPAMINE D3 DRD3_HUMAN Dopamine D3 receptor (D3) Dopamine receptor Dopamine receptor D3
Type:
Mol. Mass.:
44243.43
Organism:
Homo sapiens (Human)
Description:
Residue:
400
  
Inhibitor
Name:
BDBM50054067
Synonyms:
(2R)-7-Dipropylamino-5,6,7,8-tetrahydro-naphthalen-2-ol (R)-7-(dipropylamino)-5,6,7,8-tetrahydronaphthalen-2-ol (R)-7-Dipropylamino-5,6,7,8-tetrahydro-naphthalen-2-ol.HCl CHEMBL301559
Type:
Small organic molecule
Emp. Form.:
C16H25NO
Mol. Mass.:
247.3758
SMILES:
CCCN(CCC)[C@@H]1CCc2ccc(O)cc2C1
: