Target
Kappa-type opioid receptor
Ligand
BDBM50135800
Substrate
Meas. Tech.
ChEMBL_145395 (CHEMBL752737)
Ki
0.034±n/a nM
Citation
 Neumeyer, JLZhang, AXiong, WGu, XHHilbert, JEKnapp, BINegus, SSMello, NKBidlack, JM Design and synthesis of novel dimeric morphinan ligands for kappa and micro opioid receptors. J Med Chem 46:5162-70 (2003)  
Target
Name:
Kappa-type opioid receptor
Synonyms:
K-OR-1 Kappa-opioid receptor (KOR) Kappa-type opioid receptor (KOR) OPIATE Kappa OPRK1 kappa opioid receptor (KOR)
Type:
G Protein-Coupled Receptor (GPCR)
Mol. Mass.:
42648.76
Organism:
Homo sapiens (Human)
Description:
P41145
Residue:
380
  
Inhibitor
Name:
BDBM50135800
Synonyms:
(-)-3-Hydroxy-N-cycloproypylmethylmorphinan Mandelate 3-Hydroxy-N-cyclopropylmethylmorphinan CYCLORPHAN US10736890, Compound TABLE B.6 US9656961, Example 00123
Type:
Small organic molecule
Emp. Form.:
C20H27NO
Mol. Mass.:
297.4345
SMILES:
Oc1ccc2C[C@@H]3[C@@H]4CCCC[C@]4(CCN3CC3CC3)c2c1
: