Target
Solute carrier family 15 member 1
Ligand
BDBM50118936
Substrate
Meas. Tech.
ChEMBL_89213 (CHEMBL699705)
Ki
5620000±n/a nM
Citation
 Gebauer, SKnütter, IHartrodt, BBrandsch, MNeubert, KThondorf, I Three-dimensional quantitative structure-activity relationship analyses of peptide substrates of the mammalian H+/peptide cotransporter PEPT1. J Med Chem 46:5725-34 (2003)  
Target
Name:
Solute carrier family 15 member 1
Synonyms:
Intestinal H(+)/peptide cotransporter Oligopeptide transporter, small intestine isoform Peptide transporter 1 SLC15A1
Type:
PROTEIN
Mol. Mass.:
78818.07
Organism:
Homo sapiens (Human)
Description:
ChEMBL_1488839
Residue:
708
  
Inhibitor
Name:
BDBM50118936
Synonyms:
2-Amino-3-methyl-1-piperidin-1-yl-pentan-1-one CHEMBL93507
Type:
Small organic molecule
Emp. Form.:
C11H22N2O
Mol. Mass.:
198.3052
SMILES:
CCC(C)C(N)C(=O)N1CCCCC1
: